{"text_format":"1","workbook":"xlsx","n_sheets":6,"sheets":["Form","Sheet2","Sheet3","Sheet4","Sheet6","Sheet5"],"not_rendered":{"charts":0,"images":0,"macros":1,"external_links":0,"defined_names":1,"comments":1,"pivot_tables":0},"unopened":[],"bounds":{"document_bytes":16777216,"sheet_cells":100000,"rows_first":2000,"rows_last":500,"rows_between":2000,"halvings":0,"cell_chars":16384,"cell_head_chars":4096},"cells_cut":0,"cells_raw":0,"read":"whole","date_system":"1900"}

{"sheet":"Form","index":0,"n_rows":75,"n_cols":15,"rows_kept":75,"cut":false,"hidden":false,"merged":[[1,0,1,3],[39,2,39,5],[42,0,42,5],[41,0,41,5],[2,4,2,9],[26,7,26,9],[25,7,25,9],[24,7,24,9],[18,7,18,9],[34,7,34,9],[33,7,33,9],[32,7,32,9],[31,7,31,9],[30,7,30,9],[29,7,29,9],[38,7,38,9],[53,0,53,9],[44,0,44,2],[44,3,44,5],[45,3,45,5],[45,0,45,2],[50,0,50,3],[51,0,51,3],[50,4,50,5],[51,4,51,5],[46,0,46,5],[47,0,47,5],[48,0,48,1],[49,0,49,1],[48,4,48,5],[49,4,49,5],[54,0,56,5],[11,7,11,9],[10,7,10,9],[15,7,15,9],[14,7,14,9],[13,7,13,9],[12,7,12,9],[19,7,19,9],[17,7,17,9],[16,7,16,9],[23,7,23,9],[22,7,22,9],[21,7,21,9],[20,7,20,9],[28,7,28,9],[27,7,27,9],[43,7,43,9],[42,7,42,9],[41,7,41,9],[40,7,40,9],[39,7,39,9],[37,7,37,9],[36,7,36,9],[35,7,35,9],[4,7,4,9],[3,7,3,9],[7,7,7,9],[6,7,6,9],[5,7,5,9],[14,0,14,3],[15,0,15,3],[12,1,12,3],[9,7,9,9],[8,7,8,9],[20,1,20,3],[31,1,31,3],[32,1,32,3],[33,1,33,3],[27,1,27,3],[28,1,28,3],[29,1,29,3],[30,1,30,3],[40,1,40,5],[0,6,0,7],[0,0,0,3],[23,1,23,3],[24,1,24,3],[37,1,37,3],[34,1,34,3],[35,1,35,3],[11,0,11,3],[25,1,25,3],[26,1,26,3],[18,1,18,3],[19,1,19,3],[21,1,21,3],[22,1,22,3],[36,1,36,3]]}
["NEVADA DEPARTMENT OF TAXATION",null,null,null,null,"Certificate No.:",{"$f":"N56","v":"1000978583"},null,"-","001"]
["VEHICLE"]
["USE TAX RETURN",null,null,null,"For Department Use Only"]
[]
[]
["Mail Original To:"]
["Nevada Department of Taxation"]
["3850 Arrowhead Dr., 2nd Floor"]
["Carson City NV 89706"]
[]
[null,null,null,null,"For","month","ending:"]
[null,null,null,null,null,null,"Date paid:"]
["Due on or before:",{"$f":"VLOOKUP(IF(ISBLANK($H$11),NOW(),$H$11),Sheet5!A145:B200,2)","v":"2024-04-30"}]
[]
["County Use Tax "]
["CHURCHILL"]
[]
[null,null,null,null,null,null,"A RETURN MUST BE FILED EVEN IF NO TAX LIABILITY EXISTS"]
["ENTER AMOUNTS IN COUNTY OF USE","AMOUNT SUBJECT TO USE TAX",null,null,"TAX RATE",null,null,"CALCULATED TAX"]
["TAX CALCULATION FORMULA","COLUMN A",null,null,null,"X COLUMN B",null,"= COLUMN C"]
["CHURCHILL",null,null,null,{"$f":"VLOOKUP(IF(ISBLANK($H$11),NOW(),$H$11),Sheet3!A1:R421,2)","v":7.5999999999999998E-2},"or",{"$f":"VLOOKUP(IF(ISBLANK($H$11),NOW(),$H$11),Sheet3!$A$1:$R$421,2)","v":7.5999999999999998E-2},{"$f":"B21*G21","v":0}]
["CLARK",null,null,null,{"$f":"VLOOKUP(IF(ISBLANK($H$11),NOW(),$H$11),Sheet3!$A$1:$R$421,3)","v":8.3750000000000005E-2},"or",{"$f":"VLOOKUP(IF(ISBLANK($H$11),NOW(),$H$11),Sheet3!$A$1:$R$421,3)","v":8.3750000000000005E-2},{"$f":"B22*G22","v":0}]
["DOUGLAS",null,null,null,{"$f":"VLOOKUP(IF(ISBLANK($H$11),NOW(),$H$11),Sheet3!$A$1:$R$421,4)","v":7.0999999999999994E-2},"or",{"$f":"VLOOKUP(IF(ISBLANK($H$11),NOW(),$H$11),Sheet3!$A$1:$R$421,4)","v":7.0999999999999994E-2},0]
["ELKO",null,null,null,{"$f":"VLOOKUP(IF(ISBLANK($H$11),NOW(),$H$11),Sheet3!$A$1:$R$421,5)","v":7.0999999999999994E-2},"or",{"$f":"VLOOKUP(IF(ISBLANK($H$11),NOW(),$H$11),Sheet3!$A$1:$R$421,5)","v":7.0999999999999994E-2},0]
["ESMERALDA",null,null,null,{"$f":"VLOOKUP(IF(ISBLANK($H$11),NOW(),$H$11),Sheet3!$A$1:$R$421,6)","v":6.8500000000000005E-2},"or",{"$f":"VLOOKUP(IF(ISBLANK($H$11),NOW(),$H$11),Sheet3!$A$1:$R$421,6)","v":6.8500000000000005E-2},0]
["EUREKA",null,null,null,{"$f":"VLOOKUP(IF(ISBLANK($H$11),NOW(),$H$11),Sheet3!$A$1:$R$421,7)","v":6.8500000000000005E-2},"or",{"$f":"VLOOKUP(IF(ISBLANK($H$11),NOW(),$H$11),Sheet3!$A$1:$R$421,7)","v":6.8500000000000005E-2},0]
["HUMBOLDT",null,null,null,{"$f":"VLOOKUP(IF(ISBLANK($H$11),NOW(),$H$11),Sheet3!$A$1:$R$421,8)","v":6.8500000000000005E-2},"or",{"$f":"VLOOKUP(IF(ISBLANK($H$11),NOW(),$H$11),Sheet3!$A$1:$R$421,8)","v":6.8500000000000005E-2},0]
["LANDER",null,null,null,{"$f":"VLOOKUP(IF(ISBLANK($H$11),NOW(),$H$11),Sheet3!$A$1:$R$421,9)","v":7.0999999999999994E-2},"or",{"$f":"VLOOKUP(IF(ISBLANK($H$11),NOW(),$H$11),Sheet3!$A$1:$R$421,9)","v":7.0999999999999994E-2},0]
["LINCOLN",null,null,null,{"$f":"VLOOKUP(IF(ISBLANK($H$11),NOW(),$H$11),Sheet3!$A$1:$R$421,10)","v":7.0999999999999994E-2},"or",{"$f":"VLOOKUP(IF(ISBLANK($H$11),NOW(),$H$11),Sheet3!$A$1:$R$421,10)","v":7.0999999999999994E-2},0]
["LYON",null,null,null,{"$f":"VLOOKUP(IF(ISBLANK($H$11),NOW(),$H$11),Sheet3!$A$1:$R$421,11)","v":7.0999999999999994E-2},"or",{"$f":"VLOOKUP(IF(ISBLANK($H$11),NOW(),$H$11),Sheet3!$A$1:$R$421,11)","v":7.0999999999999994E-2},0]
{"$rows_left_out":46}
{"sheet":"Sheet2","index":1,"n_rows":420,"n_cols":11,"rows_kept":420,"cut":false,"hidden":true,"merged":[]}
["1990-01-01",1,{"$f":"A2-1","v":"1990-01-31"}]
["1990-02-01",2,"1990-02-28"]
["1990-03-01",3,"1990-03-31"]
["1990-04-01",4,"1990-04-30"]
["1990-05-01",5,"1990-05-31"]
["1990-06-01",6,"1990-06-30"]
["1990-07-01",7,"1990-07-31"]
["1990-08-01",8,"1990-08-31"]
["1990-09-01",9,"1990-09-30"]
["1990-10-01",10,"1990-10-31"]
["1990-11-01",11,"1990-11-30"]
["1990-12-01",12,"1990-12-31"]
["1991-01-01",13,"1991-01-31"]
["1991-02-01",14,"1991-02-28"]
["1991-03-01",15,"1991-03-31"]
["1991-04-01",16,"1991-04-30"]
["1991-05-01",17,{"$f":"A18-1","v":"1991-05-31"}]
["1991-06-01",18,"1991-06-30"]
["1991-07-01",19,"1991-07-31"]
["1991-08-01",20,"1991-08-31"]
["1991-09-01",21,"1991-09-30"]
["1991-10-01",22,"1991-10-31"]
["1991-11-01",23,"1991-11-30"]
["1991-12-01",24,"1991-12-31"]
["1992-01-01",25,"1992-01-31"]
["1992-02-01",26,"1992-02-29"]
["1992-03-01",27,"1992-03-31"]
["1992-04-01",28,"1992-04-30"]
["1992-05-01",29,"1992-05-31"]
["1992-06-01",30,"1992-06-30"]
{"$rows_left_out":391}
{"sheet":"Sheet3","index":2,"n_rows":421,"n_cols":28,"rows_kept":421,"cut":false,"hidden":true,"merged":[]}
[null,1,2,3,4,5,6,7,8,9,10,11,12,13,14,15,16,17]
["1990-01-01",0.06,0.06,5.7500000000000002E-2,5.7500000000000002E-2,5.7500000000000002E-2,5.7500000000000002E-2,5.7500000000000002E-2,5.7500000000000002E-2,5.7500000000000002E-2,5.7500000000000002E-2,5.7500000000000002E-2,0.06,0.06,5.7500000000000002E-2,0.06,0.06,0.06,1.2500000000000001E-2,1.2500000000000001E-2]
["1990-02-01",0.06,0.06,5.7500000000000002E-2,5.7500000000000002E-2,5.7500000000000002E-2,5.7500000000000002E-2,5.7500000000000002E-2,5.7500000000000002E-2,5.7500000000000002E-2,5.7500000000000002E-2,5.7500000000000002E-2,0.06,0.06,5.7500000000000002E-2,0.06,0.06,0.06,1.2500000000000001E-2,1.2500000000000001E-2]
["1990-03-01",0.06,0.06,5.7500000000000002E-2,5.7500000000000002E-2,5.7500000000000002E-2,5.7500000000000002E-2,5.7500000000000002E-2,5.7500000000000002E-2,5.7500000000000002E-2,5.7500000000000002E-2,5.7500000000000002E-2,0.06,0.06,5.7500000000000002E-2,0.06,0.06,0.06,1.2500000000000001E-2,1.2500000000000001E-2]
["1990-04-01",0.06,0.06,5.7500000000000002E-2,5.7500000000000002E-2,5.7500000000000002E-2,5.7500000000000002E-2,5.7500000000000002E-2,5.7500000000000002E-2,5.7500000000000002E-2,5.7500000000000002E-2,5.7500000000000002E-2,0.06,0.06,5.7500000000000002E-2,0.06,0.06,0.06,1.2500000000000001E-2,1.2500000000000001E-2]
["1990-05-01",0.06,0.06,5.7500000000000002E-2,5.7500000000000002E-2,5.7500000000000002E-2,5.7500000000000002E-2,5.7500000000000002E-2,5.7500000000000002E-2,5.7500000000000002E-2,5.7500000000000002E-2,5.7500000000000002E-2,0.06,0.06,5.7500000000000002E-2,0.06,0.06,0.06,1.2500000000000001E-2,1.2500000000000001E-2]
["1990-06-01",0.06,0.06,5.7500000000000002E-2,5.7500000000000002E-2,5.7500000000000002E-2,5.7500000000000002E-2,5.7500000000000002E-2,5.7500000000000002E-2,5.7500000000000002E-2,5.7500000000000002E-2,5.7500000000000002E-2,0.06,0.06,5.7500000000000002E-2,0.06,0.06,0.06,1.2500000000000001E-2,1.2500000000000001E-2]
["1990-07-01",0.06,0.06,5.7500000000000002E-2,5.7500000000000002E-2,5.7500000000000002E-2,5.7500000000000002E-2,5.7500000000000002E-2,5.7500000000000002E-2,5.7500000000000002E-2,5.7500000000000002E-2,5.7500000000000002E-2,0.06,0.06,5.7500000000000002E-2,0.06,0.06,0.06,1.2500000000000001E-2,1.2500000000000001E-2]
["1990-08-01",0.06,0.06,5.7500000000000002E-2,5.7500000000000002E-2,5.7500000000000002E-2,5.7500000000000002E-2,5.7500000000000002E-2,5.7500000000000002E-2,5.7500000000000002E-2,5.7500000000000002E-2,5.7500000000000002E-2,0.06,0.06,5.7500000000000002E-2,0.06,0.06,0.06,1.2500000000000001E-2,1.2500000000000001E-2]
["1990-09-01",0.06,0.06,5.7500000000000002E-2,5.7500000000000002E-2,5.7500000000000002E-2,5.7500000000000002E-2,5.7500000000000002E-2,5.7500000000000002E-2,5.7500000000000002E-2,5.7500000000000002E-2,5.7500000000000002E-2,0.06,0.06,5.7500000000000002E-2,0.06,0.06,0.06,1.2500000000000001E-2,1.2500000000000001E-2]
["1990-10-01",0.06,0.06,5.7500000000000002E-2,5.7500000000000002E-2,5.7500000000000002E-2,5.7500000000000002E-2,5.7500000000000002E-2,5.7500000000000002E-2,5.7500000000000002E-2,5.7500000000000002E-2,5.7500000000000002E-2,0.06,0.06,5.7500000000000002E-2,0.06,0.06,0.06,1.2500000000000001E-2,1.2500000000000001E-2]
["1990-11-01",0.06,0.06,5.7500000000000002E-2,5.7500000000000002E-2,5.7500000000000002E-2,5.7500000000000002E-2,5.7500000000000002E-2,5.7500000000000002E-2,5.7500000000000002E-2,5.7500000000000002E-2,5.7500000000000002E-2,0.06,0.06,5.7500000000000002E-2,0.06,0.06,0.06,1.2500000000000001E-2,1.2500000000000001E-2]
["1990-12-01",0.06,0.06,5.7500000000000002E-2,5.7500000000000002E-2,5.7500000000000002E-2,5.7500000000000002E-2,5.7500000000000002E-2,5.7500000000000002E-2,5.7500000000000002E-2,5.7500000000000002E-2,5.7500000000000002E-2,0.06,0.06,5.7500000000000002E-2,0.06,0.06,0.06,1.2500000000000001E-2,1.2500000000000001E-2]
["1991-01-01",0.06,0.06,5.7500000000000002E-2,5.7500000000000002E-2,5.7500000000000002E-2,5.7500000000000002E-2,5.7500000000000002E-2,5.7500000000000002E-2,5.7500000000000002E-2,5.7500000000000002E-2,5.7500000000000002E-2,0.06,0.06,5.7500000000000002E-2,0.06,0.06,0.06,1.2500000000000001E-2,1.2500000000000001E-2]
["1991-02-01",0.06,0.06,5.7500000000000002E-2,5.7500000000000002E-2,5.7500000000000002E-2,5.7500000000000002E-2,5.7500000000000002E-2,5.7500000000000002E-2,5.7500000000000002E-2,5.7500000000000002E-2,5.7500000000000002E-2,0.06,0.06,5.7500000000000002E-2,0.06,0.06,0.06,1.2500000000000001E-2,1.2500000000000001E-2]
["1991-03-01",0.06,0.06,5.7500000000000002E-2,5.7500000000000002E-2,5.7500000000000002E-2,5.7500000000000002E-2,5.7500000000000002E-2,5.7500000000000002E-2,5.7500000000000002E-2,5.7500000000000002E-2,5.7500000000000002E-2,0.06,0.06,5.7500000000000002E-2,0.06,0.06,0.06,1.2500000000000001E-2,1.2500000000000001E-2]
["1991-04-01",0.06,0.06,5.7500000000000002E-2,5.7500000000000002E-2,5.7500000000000002E-2,5.7500000000000002E-2,5.7500000000000002E-2,5.7500000000000002E-2,5.7500000000000002E-2,5.7500000000000002E-2,5.7500000000000002E-2,0.06,0.06,5.7500000000000002E-2,0.06,0.06,0.06,1.2500000000000001E-2,1.2500000000000001E-2]
["1991-05-01",0.06,0.06,5.7500000000000002E-2,5.7500000000000002E-2,5.7500000000000002E-2,5.7500000000000002E-2,5.7500000000000002E-2,5.7500000000000002E-2,5.7500000000000002E-2,5.7500000000000002E-2,5.7500000000000002E-2,0.06,0.06,5.7500000000000002E-2,0.06,0.06,0.06,1.2500000000000001E-2,1.2500000000000001E-2]
["1991-06-01",0.06,0.06,5.7500000000000002E-2,5.7500000000000002E-2,5.7500000000000002E-2,5.7500000000000002E-2,5.7500000000000002E-2,5.7500000000000002E-2,5.7500000000000002E-2,5.7500000000000002E-2,5.7500000000000002E-2,0.06,0.06,5.7500000000000002E-2,0.06,0.06,0.06,1.2500000000000001E-2,1.2500000000000001E-2]
["1991-07-01",0.06,6.25E-2,5.7500000000000002E-2,5.7500000000000002E-2,5.7500000000000002E-2,5.7500000000000002E-2,5.7500000000000002E-2,5.7500000000000002E-2,5.7500000000000002E-2,5.7500000000000002E-2,5.7500000000000002E-2,0.06,0.06,5.7500000000000002E-2,0.06,0.06,0.06,1.2500000000000001E-2,1.2500000000000001E-2]
["1991-08-01",0.06,6.25E-2,5.7500000000000002E-2,5.7500000000000002E-2,5.7500000000000002E-2,5.7500000000000002E-2,5.7500000000000002E-2,5.7500000000000002E-2,5.7500000000000002E-2,5.7500000000000002E-2,5.7500000000000002E-2,0.06,0.06,5.7500000000000002E-2,0.06,0.06,0.06,1.2500000000000001E-2,1.2500000000000001E-2]
["1991-09-01",0.06,6.25E-2,5.7500000000000002E-2,5.7500000000000002E-2,5.7500000000000002E-2,5.7500000000000002E-2,5.7500000000000002E-2,5.7500000000000002E-2,5.7500000000000002E-2,5.7500000000000002E-2,5.7500000000000002E-2,0.06,0.06,5.7500000000000002E-2,0.06,0.06,0.06,1.2500000000000001E-2,1.2500000000000001E-2]
["1991-10-01",7.0000000000000007E-2,7.0000000000000007E-2,6.5000000000000002E-2,6.5000000000000002E-2,6.5000000000000002E-2,6.5000000000000002E-2,6.5000000000000002E-2,6.5000000000000002E-2,6.5000000000000002E-2,6.5000000000000002E-2,6.5000000000000002E-2,6.7500000000000004E-2,6.7500000000000004E-2,6.5000000000000002E-2,6.7500000000000004E-2,7.0000000000000007E-2,6.7500000000000004E-2,1.2500000000000001E-2,1.2500000000000001E-2]
["1991-11-01",7.0000000000000007E-2,7.0000000000000007E-2,6.5000000000000002E-2,6.5000000000000002E-2,6.5000000000000002E-2,6.5000000000000002E-2,6.5000000000000002E-2,6.5000000000000002E-2,6.5000000000000002E-2,6.5000000000000002E-2,6.5000000000000002E-2,6.7500000000000004E-2,6.7500000000000004E-2,6.5000000000000002E-2,6.7500000000000004E-2,7.0000000000000007E-2,6.7500000000000004E-2,1.2500000000000001E-2,1.2500000000000001E-2]
["1991-12-01",7.0000000000000007E-2,7.0000000000000007E-2,6.5000000000000002E-2,6.5000000000000002E-2,6.5000000000000002E-2,6.5000000000000002E-2,6.5000000000000002E-2,6.5000000000000002E-2,6.5000000000000002E-2,6.5000000000000002E-2,6.5000000000000002E-2,6.7500000000000004E-2,6.7500000000000004E-2,6.5000000000000002E-2,6.7500000000000004E-2,7.0000000000000007E-2,6.7500000000000004E-2,1.2500000000000001E-2,1.2500000000000001E-2]
["1992-01-01",7.0000000000000007E-2,7.0000000000000007E-2,6.5000000000000002E-2,6.5000000000000002E-2,6.5000000000000002E-2,6.5000000000000002E-2,6.5000000000000002E-2,6.5000000000000002E-2,6.5000000000000002E-2,6.5000000000000002E-2,6.5000000000000002E-2,6.7500000000000004E-2,6.7500000000000004E-2,6.5000000000000002E-2,6.7500000000000004E-2,7.0000000000000007E-2,6.7500000000000004E-2,1.2500000000000001E-2,1.2500000000000001E-2]
["1992-02-01",7.0000000000000007E-2,7.0000000000000007E-2,6.5000000000000002E-2,6.5000000000000002E-2,6.5000000000000002E-2,6.5000000000000002E-2,6.5000000000000002E-2,6.5000000000000002E-2,6.5000000000000002E-2,6.5000000000000002E-2,6.5000000000000002E-2,6.7500000000000004E-2,6.7500000000000004E-2,6.5000000000000002E-2,6.7500000000000004E-2,7.0000000000000007E-2,6.7500000000000004E-2,1.2500000000000001E-2,1.2500000000000001E-2]
["1992-03-01",7.0000000000000007E-2,7.0000000000000007E-2,6.5000000000000002E-2,6.5000000000000002E-2,6.5000000000000002E-2,6.5000000000000002E-2,6.5000000000000002E-2,6.5000000000000002E-2,6.5000000000000002E-2,6.5000000000000002E-2,6.5000000000000002E-2,6.7500000000000004E-2,6.7500000000000004E-2,6.5000000000000002E-2,6.7500000000000004E-2,7.0000000000000007E-2,6.7500000000000004E-2,1.2500000000000001E-2,1.2500000000000001E-2]
["1992-04-01",7.0000000000000007E-2,7.0000000000000007E-2,6.5000000000000002E-2,6.5000000000000002E-2,6.5000000000000002E-2,6.5000000000000002E-2,6.5000000000000002E-2,6.5000000000000002E-2,6.5000000000000002E-2,6.5000000000000002E-2,6.5000000000000002E-2,6.7500000000000004E-2,6.7500000000000004E-2,6.5000000000000002E-2,6.7500000000000004E-2,7.0000000000000007E-2,6.7500000000000004E-2,1.2500000000000001E-2,1.2500000000000001E-2]
["1992-05-01",7.0000000000000007E-2,7.0000000000000007E-2,6.5000000000000002E-2,6.5000000000000002E-2,6.5000000000000002E-2,6.5000000000000002E-2,6.5000000000000002E-2,6.5000000000000002E-2,6.5000000000000002E-2,6.5000000000000002E-2,6.5000000000000002E-2,6.7500000000000004E-2,6.7500000000000004E-2,6.5000000000000002E-2,6.7500000000000004E-2,7.0000000000000007E-2,6.7500000000000004E-2,1.2500000000000001E-2,1.2500000000000001E-2]
{"$rows_left_out":392}
{"sheet":"Sheet4","index":3,"n_rows":384,"n_cols":8,"rows_kept":384,"cut":false,"hidden":true,"merged":[]}
["1993-01-31",1.4999999999999999E-2]
["1993-02-28",1.4999999999999999E-2]
["1993-03-31",1.4999999999999999E-2]
["1993-04-30",1.4999999999999999E-2]
["1993-05-31",1.4999999999999999E-2]
["1993-06-30",1.4999999999999999E-2]
["1993-07-31",1.4999999999999999E-2]
["1993-08-31",1.4999999999999999E-2]
["1993-09-30",1.4999999999999999E-2]
["1993-10-31",1.4999999999999999E-2]
["1993-11-30",1.4999999999999999E-2]
["1993-12-31",1.4999999999999999E-2]
["1994-01-31",1.4999999999999999E-2]
["1994-02-28",1.4999999999999999E-2]
["1994-03-31",1.4999999999999999E-2]
["1994-04-30",1.4999999999999999E-2]
["1994-05-31",1.4999999999999999E-2]
["1994-06-30",1.4999999999999999E-2]
["1994-07-31",1.4999999999999999E-2]
["1994-08-31",1.4999999999999999E-2]
["1994-09-30",1.4999999999999999E-2]
["1994-10-31",1.4999999999999999E-2]
["1994-11-30",1.4999999999999999E-2]
["1994-12-31",1.4999999999999999E-2]
["1995-01-31",1.4999999999999999E-2]
["1995-02-28",1.4999999999999999E-2]
["1995-03-31",1.4999999999999999E-2]
["1995-04-30",1.4999999999999999E-2]
["1995-05-31",1.4999999999999999E-2]
["1995-06-30",1.4999999999999999E-2]
{"$rows_left_out":355}
{"sheet":"Sheet6","index":4,"n_rows":421,"n_cols":11,"rows_kept":421,"cut":false,"hidden":true,"merged":[]}
[null,0,"1 to 10","11 to 15","16 to 20","21 to 30","31+"]
["1990-01-31",0,0.1,0.1,0.1,0.1,0.1]
["1990-02-28",0,0.1,0.1,0.1,0.1,0.1]
["1990-03-31",0,0.1,0.1,0.1,0.1,0.1]
["1990-04-30",0,0.1,0.1,0.1,0.1,0.1]
["1990-05-31",0,0.1,0.1,0.1,0.1,0.1]
["1990-06-30",0,0.1,0.1,0.1,0.1,0.1]
["1990-07-31",0,0.1,0.1,0.1,0.1,0.1]
["1990-08-31",0,0.1,0.1,0.1,0.1,0.1]
["1990-09-30",0,0.1,0.1,0.1,0.1,0.1]
["1990-10-31",0,0.1,0.1,0.1,0.1,0.1]
["1990-11-30",0,0.1,0.1,0.1,0.1,0.1]
["1990-12-31",0,0.1,0.1,0.1,0.1,0.1]
["1991-01-31",0,0.1,0.1,0.1,0.1,0.1]
["1991-02-28",0,0.1,0.1,0.1,0.1,0.1]
["1991-03-31",0,0.1,0.1,0.1,0.1,0.1]
["1991-04-30",0,0.1,0.1,0.1,0.1,0.1]
["1991-05-31",0,0.1,0.1,0.1,0.1,0.1]
["1991-06-30",0,0.1,0.1,0.1,0.1,0.1]
["1991-07-31",0,0.1,0.1,0.1,0.1,0.1]
["1991-08-31",0,0.1,0.1,0.1,0.1,0.1]
["1991-09-30",0,0.1,0.1,0.1,0.1,0.1]
["1991-10-31",0,0.1,0.1,0.1,0.1,0.1]
["1991-11-30",0,0.1,0.1,0.1,0.1,0.1]
["1991-12-31",0,0.1,0.1,0.1,0.1,0.1]
["1992-01-31",0,0.1,0.1,0.1,0.1,0.1]
["1992-02-29",0,0.1,0.1,0.1,0.1,0.1]
["1992-03-31",0,0.1,0.1,0.1,0.1,0.1]
["1992-04-30",0,0.1,0.1,0.1,0.1,0.1]
["1992-05-31",0,0.1,0.1,0.1,0.1,0.1]
{"$rows_left_out":392}
{"sheet":"Sheet5","index":5,"n_rows":192,"n_cols":8,"rows_kept":192,"cut":false,"hidden":true,"merged":[]}
["2009-01-31","2009-03-02"]
["2009-02-28","2009-03-31"]
["2009-03-31","2009-04-30"]
["2009-04-30","2009-06-01"]
["2009-05-31","2009-06-30"]
["2009-06-30","2009-07-31"]
["2009-07-31","2009-08-31"]
["2009-08-31","2009-09-30"]
["2009-09-30","2009-11-02"]
["2009-10-31","2009-11-30"]
["2009-11-30","2009-12-31"]
["2009-12-31","2010-02-01"]
["2010-01-31","2010-03-01"]
["2010-02-28","2010-03-31"]
["2010-03-31","2010-04-30"]
["2010-04-30","2010-06-01"]
["2010-05-31","2010-06-30"]
["2010-06-30","2010-08-02"]
["2010-07-31","2010-08-31"]
["2010-08-31","2010-09-30"]
["2010-09-30","2010-11-01"]
["2010-10-31","2010-11-30"]
["2010-11-30","2010-12-31"]
["2010-12-31","2011-01-31"]
["2011-01-31","2011-02-28"]
["2011-02-28","2011-03-31"]
["2011-03-31","2011-05-02"]
["2011-04-30","2011-05-31"]
["2011-05-31","2011-06-30"]
["2011-06-30","2011-08-01"]
{"$rows_left_out":162}